我最近从2005年升级到2012年(我很确定),在构建我的解决方案时遇到链接错误. google搜索几个小时后我就想出来了.我已经建立了几十个项目,所以我很确定我已经做了一切正确的事情,但公平的说,已经有几年了.
@H_301_10@所以,作为一个测试,我设立了一个新的项目.我把它叫做App,一个Windows应用程序(.exe).我创建了一个名为Core的第二个项目,并将其标记为其配置类型中的静态库(.lib).两者都是解决方案的一部分.在Core中,我添加了Test.cpp和Test.h,它包含一个具有简单功能的小类.然后,在Window的应用程序WinMain.cpp文件中,我有WinMain(),我通过CTest测试调用这个测试类;测试结果();
与此同时,我将项目应用程序的项目依赖项设置为核心,最后添加到App的“附加包含”目录中,以便Test.cpp / .h生成的核心代码.
我得到以下链接错误,不能为我的生活找出为什么.有没有人知道2012年以前版本可能错过了哪些步骤?非常感谢您的帮助!
1>------ Build started: Project: App,Configuration: Debug Win32 ------ 1>WinMain.obj : error LNK2019: unresolved external symbol "public: __thiscall CTest::CTest(void)" (??0CTest@@QAE@XZ) referenced in function _WinMain@16 1>WinMain.obj : error LNK2019: unresolved external symbol "public: __thiscall CTest::~CTest(void)" (??1CTest@@QAE@XZ) referenced in function _WinMain@16 1>WinMain.obj : error LNK2019: unresolved external symbol "public: int __thiscall CTest::Result(void)" (?Result@CTest@@QAEHXZ) referenced in function _WinMain@16 1>D:\Work\Test_Linker_Stupidity\App\Debug\App.exe : fatal error LNK1120: 3 unresolved externals ========== Build: 0 succeeded,1 Failed,1 up-to-date,0 skipped ========